BDBM50241917 CHEMBL508807::Nocardimicin F
SMILES CCCCCCCCCCCCCCCC(OC(=O)C(CCCCN(O)C(C)=O)NC(=O)c1coc(n1)-c1ccccc1O)C(C)C(=O)NC1CCCCN(O)C1=O
InChI Key InChIKey=JJWFEHNQRVSVKR-UHFFFAOYSA-N
Data  1 KI  1 IC50
  Tab Delimited (TSV)   2D SDfile   Computed 3D by Vconf -m prep SDfile
Find this compound or compounds like it in BindingDB:
Activity Spreadsheet -- Enzyme Inhibition Constant Data from BindingDB
Found 2 hits for monomerid = 50241917
TargetMuscarinic acetylcholine receptor M3(Homo sapiens (Human))
Mitsubishi Pharma
Curated by ChEMBL
LigandPNGBDBM50241917(CHEMBL508807 | Nocardimicin F)
Affinity DataKi:  1.33E+3nM. Assay description: Displacement of [3H]NMS from human muscarinic M3 receptor expressed in insect Sf9 cells
In DepthDetails ArticlePubMed
TargetMuscarinic acetylcholine receptor M3(Homo sapiens (Human))
Mitsubishi Pharma
Curated by ChEMBL
LigandPNGBDBM50241917(CHEMBL508807 | Nocardimicin F)
Affinity DataIC50:  6.29E+3nM. Assay description: Displacement of [3H]NMS from human muscarinic M3 receptor expressed in insect Sf9 cells
In DepthDetails ArticlePubMed