BDBM50242714 3-(4-(3-(3,4-difluorophenyl)-3-oxoprop-1-enyl)-1-methyl-1H-pyrrol-2-yl)-N-hydroxyacrylamide::CHEMBL461078
SMILES Cn1cc(\C=C\C(=O)c2ccc(F)c(F)c2)cc1\C=C\C(=O)NO
InChI Key InChIKey=KKANROICAVGIFI-DDEVBNQJSA-N
Data  1 IC50
  Tab Delimited (TSV)   2D SDfile   Computed 3D by Vconf -m prep SDfile
Find this compound or compounds like it in BindingDB:
Activity Spreadsheet -- Enzyme Inhibition Constant Data from BindingDB
Found 1 hit for monomerid = 50242714
TargetHistone deacetylase(Zea mays)
Sapienza University Of Rome
Curated by ChEMBL
LigandPNGBDBM50242714(3-(4-(3-(3,4-difluorophenyl)-3-oxoprop-1-enyl)-1-m...)
Affinity DataIC50:  1.35E+4nM. Assay description: Inhibition of maize histone deacetylase 1B
In DepthDetails ArticlePubMed