BDBM50242776 1-(4'-Nitrophenyl)-1H-pyrazolo[3,4-d]pyrimidin-4-ylamine::CHEMBL512212
SMILES Nc1ncnc2n(ncc12)-c1ccc(cc1)[N+]([O-])=O
InChI Key InChIKey=NFVAFEQWWNNKLX-UHFFFAOYSA-N
Data  1 IC50
  Tab Delimited (TSV)   2D SDfile   Computed 3D by Vconf -m prep SDfile
Find this compound or compounds like it in BindingDB:
Activity Spreadsheet -- Enzyme Inhibition Constant Data from BindingDB
Found 1 hit for monomerid = 50242776
TargetXanthine dehydrogenase/oxidase(Homo sapiens (Human))
Universidade Do Minho
Curated by ChEMBL
LigandPNGBDBM50242776(1-(4'-Nitrophenyl)-1H-pyrazolo[3,4-d]pyrimidin-4-y...)
Affinity DataIC50:  2.20E+3nM. Assay description: Inhibition of xanthine oxidase (unknown origin)
In DepthDetails ArticlePubMed