BDBM50242854 (2S,3S)-2-amino-1-(5-fluoroisoindolin-2-yl)-3-methylpentan-1-one::CHEMBL466590
SMILES CC[C@H](C)[C@H](N)C(=O)N1Cc2ccc(F)cc2C1
InChI Key InChIKey=MMZVCOZOFNZWBM-ZANVPECISA-N
Data  4 IC50
  Tab Delimited (TSV)   2D SDfile   Computed 3D by Vconf -m prep SDfile
Find this compound or compounds like it in BindingDB:
Activity Spreadsheet -- Enzyme Inhibition Constant Data from BindingDB
Found 4 hits for monomerid = 50242854
TargetDipeptidyl peptidase 4(Homo sapiens (Human))
University Of Antwerp
Curated by ChEMBL
LigandPNGBDBM50242854((2S,3S)-2-amino-1-(5-fluoroisoindolin-2-yl)-3-meth...)
Affinity DataIC50:  8.01E+4nM. Assay description: Inhibition of DPP4 (unknown origin)
In DepthDetails ArticlePubMed
TargetDipeptidyl peptidase 8(Homo sapiens (Human))
University Of Antwerp
Curated by ChEMBL
LigandPNGBDBM50242854((2S,3S)-2-amino-1-(5-fluoroisoindolin-2-yl)-3-meth...)
Affinity DataIC50:  1.20E+3nM. Assay description: Inhibition of DPP8 (unknown origin)
In DepthDetails ArticlePubMed
TargetDipeptidyl peptidase 9(Homo sapiens (Human))
University Of Antwerp
Curated by ChEMBL
LigandPNGBDBM50242854((2S,3S)-2-amino-1-(5-fluoroisoindolin-2-yl)-3-meth...)
Affinity DataIC50:  540nM. Assay description: Inhibition of DPP9 (unknown origin)
In DepthDetails ArticlePubMed
TargetDipeptidyl peptidase 2(Homo sapiens (Human))
University Of Antwerp
Curated by ChEMBL
LigandPNGBDBM50242854((2S,3S)-2-amino-1-(5-fluoroisoindolin-2-yl)-3-meth...)
Affinity DataIC50:  2.30E+4nM. Assay description: Inhibition of DPP2 (unknown origin)
In DepthDetails ArticlePubMed