BDBM50242913 CHEMBL472303::N-[4-({[2-(4-Chlorobenzoyl)phenyl]amino}sulfonyl)phenyl]-acetamide
SMILES CC(=O)Nc1ccc(cc1)S(=O)(=O)Nc1ccccc1C(=O)c1ccc(Cl)cc1
InChI Key InChIKey=KYDFMBXPKDAQMV-UHFFFAOYSA-N
Data  1 KI
  Tab Delimited (TSV)   2D SDfile   Computed 3D by Vconf -m prep SDfile
Find this compound or compounds like it in BindingDB:
Activity Spreadsheet -- Enzyme Inhibition Constant Data from BindingDB
Found 1 hit for monomerid = 50242913
TargetB1 bradykinin receptor(Homo sapiens (Human))
Merck Research Laboratories
Curated by ChEMBL
LigandPNGBDBM50242913(CHEMBL472303 | N-[4-({[2-(4-Chlorobenzoyl)phenyl]a...)
Affinity DataKi:  70nM. Assay description: Binding affinity to human bradykinin B1 receptor
In DepthDetails ArticlePubMed