BDBM50242990 3beta-(4-methylphenyl)-2beta-[3'-methyl-4'-(4-methylphenyl)isoxazol-5-yl]tropanehydrochloride::CHEMBL511288
SMILES CN1C2CCC1[C@H]([C@H](C2)c1ccc(C)cc1)c1onc(C)c1-c1ccc(C)cc1
InChI Key InChIKey=FORRMNHGFHBAMR-XJAHMCCXSA-N
Data  2 KI  1 IC50
  Tab Delimited (TSV)   2D SDfile   Computed 3D by Vconf -m prep SDfile
Find this compound or compounds like it in BindingDB:
Activity Spreadsheet -- Enzyme Inhibition Constant Data from BindingDB
Found 3 hits for monomerid = 50242990
TargetSodium-dependent serotonin transporter(Homo sapiens (Human))
Research Triangle Institute
Curated by ChEMBL
LigandPNGBDBM50242990(3beta-(4-methylphenyl)-2beta-[3'-methyl-4'-(4-meth...)
Affinity DataKi:  1.00E+3nM. Assay description: Displacement of [3H]paroxetine from 5HTT
In DepthDetails ArticlePubMed
TargetSodium-dependent noradrenaline transporter(Homo sapiens (Human))
Research Triangle Institute
Curated by ChEMBL
LigandPNGBDBM50242990(3beta-(4-methylphenyl)-2beta-[3'-methyl-4'-(4-meth...)
Affinity DataKi: >2.00E+3nM. Assay description: Displacement of [3H]nisoxetine from NET
In DepthDetails ArticlePubMed
TargetSodium-dependent dopamine transporter(Homo sapiens (Human))
Research Triangle Institute
Curated by ChEMBL
LigandPNGBDBM50242990(3beta-(4-methylphenyl)-2beta-[3'-methyl-4'-(4-meth...)
Affinity DataIC50:  173nM. Assay description: Displacement of [3H]WIN-35428 from DAT
In DepthDetails ArticlePubMed