BDBM50242992 CHEMBL4066805
SMILES COc1ccccc1N1C(=O)C2CN(C)C3(C2C1=O)C(=O)c1ccccc1C3=O
InChI Key InChIKey=PEYAQGQDGWLEHL-UHFFFAOYSA-N
Data  1 IC50
  Tab Delimited (TSV)   2D SDfile   Computed 3D by Vconf -m prep SDfile
Find this compound or compounds like it in BindingDB:
Activity Spreadsheet -- Enzyme Inhibition Constant Data from BindingDB
Found 1 hit for monomerid = 50242992
TargetAcetylcholinesterase(Homo sapiens (Human))
Madurai Kamaraj University
Curated by ChEMBL
LigandPNGBDBM50242992(CHEMBL4066805)
Affinity DataIC50:  1.11E+4nM. Assay description: Inhibition of AChE (unknown origin) using acetylcholine as substrate preincubated for 15 mins followed by substrate addition measured every minute by...
In DepthDetails ArticlePubMed