BDBM50243061 4-(2-{[(2R)-2-(3-Aminophenyl)-2-hydroxyethyl]amino}ethyl)-3-isopropoxy-4-biphenylcarboxylic acid::CHEMBL469685
SMILES CC(C)Oc1cc(ccc1C(O)=O)-c1ccc(CCNC[C@H](O)c2cccc(N)c2)cc1
InChI Key InChIKey=FBNLQTLDGXMFSU-DEOSSOPVSA-N
Data  2 EC50
  Tab Delimited (TSV)   2D SDfile   Computed 3D by Vconf -m prep SDfile
Find this compound or compounds like it in BindingDB:
Activity Spreadsheet -- Enzyme Inhibition Constant Data from BindingDB
Found 2 hits for monomerid = 50243061
TargetBeta-1 adrenergic receptor(Homo sapiens (Human))
Astellas Pharma
Curated by ChEMBL
LigandPNGBDBM50243061(4-(2-{[(2R)-2-(3-Aminophenyl)-2-hydroxyethyl]amino...)
Affinity DataEC50: >1.00E+3nM. Assay description: Agonist activity at human recombinant beta-1 adrenergic receptor expressed in CHO cells assessed as cAMP accumulation by enzyme immuno assay
In DepthDetails ArticlePubMed
TargetBeta-3 adrenergic receptor(Homo sapiens (Human))
Astellas Pharma
Curated by ChEMBL
LigandPNGBDBM50243061(4-(2-{[(2R)-2-(3-Aminophenyl)-2-hydroxyethyl]amino...)
Affinity DataEC50:  8.10nM. Assay description: Agonist activity at human recombinant beta3 adrenergic receptor expressed in CHO cells assessed as cAMP accumulation by enzyme immuno assay
In DepthDetails ArticlePubMed