BDBM50243068 CHEMBL469875::N-[4-({[2-(Pyridin-2-ylcarbonyl)phenyl]amino}sulfonyl)phenyl]acetamide
SMILES CC(=O)Nc1ccc(cc1)S(=O)(=O)Nc1ccccc1C(=O)c1ccccn1
InChI Key InChIKey=UBJCFGLKFLNTNI-UHFFFAOYSA-N
Data  1 KI
  Tab Delimited (TSV)   2D SDfile   Computed 3D by Vconf -m prep SDfile
Find this compound or compounds like it in BindingDB:
Activity Spreadsheet -- Enzyme Inhibition Constant Data from BindingDB
Found 1 hit for monomerid = 50243068
TargetB1 bradykinin receptor(Homo sapiens (Human))
Merck Research Laboratories
Curated by ChEMBL
LigandPNGBDBM50243068(CHEMBL469875 | N-[4-({[2-(Pyridin-2-ylcarbonyl)phe...)
Affinity DataKi:  202nM. Assay description: Binding affinity to human bradykinin B1 receptor
In DepthDetails ArticlePubMed