BDBM50243171 CHEMBL519247::N-(2-Benzoylphenyl)-4-{[(dimethylamino)carbonyl]amino}-benzenesulfonamide
SMILES CN(C)C(=O)Nc1ccc(cc1)S(=O)(=O)Nc1ccccc1C(=O)c1ccccc1
InChI Key InChIKey=IONUZUYJIIWEOG-UHFFFAOYSA-N
Data  1 KI
  Tab Delimited (TSV)   2D SDfile   Computed 3D by Vconf -m prep SDfile
Find this compound or compounds like it in BindingDB:
Activity Spreadsheet -- Enzyme Inhibition Constant Data from BindingDB
Found 1 hit for monomerid = 50243171
TargetB1 bradykinin receptor(Homo sapiens (Human))
Merck Research Laboratories
Curated by ChEMBL
LigandPNGBDBM50243171(CHEMBL519247 | N-(2-Benzoylphenyl)-4-{[(dimethylam...)
Affinity DataKi:  215nM. Assay description: Binding affinity to human bradykinin B1 receptor
In DepthDetails ArticlePubMed