BDBM50243577 (4S)-N-(4-{[(4R,7S,10S,13R,16S,19S)-19-[(2R)-2-amino-3-(4-chlorophenyl)propanamido]-10-(4-aminobutyl)-4-{[(1S)-1-carbamoyl-2-(naphthalen-2-yl)ethyl]carbamoyl}-13-{[4-(carbamoylamino)phenyl]methyl}-7-[(1R)-1-hydroxyethyl]-6,9,12,15,18-pentaoxo-1,2-dithia-5,8,11,14,17-pentaazacycloicosan-16-yl]methyl}phenyl)-2,6-dioxo-1,3-diazinane-4-carboxamide::CHEMBL506326
SMILES C[C@@H](O)[C@@H]1NC(=O)[C@H](CCCCN)NC(=O)[C@@H](Cc2ccc(NC(N)=O)cc2)NC(=O)[C@H](Cc2ccc(NC(=O)[C@@H]3CC(=O)NC(=O)N3)cc2)NC(=O)[C@@H](CSSC[C@H](NC1=O)C(=O)N[C@@H](Cc1ccc2ccccc2c1)C(N)=O)NC(=O)[C@H](N)Cc1ccc(Cl)cc1
InChI Key InChIKey=NVAWGHCXUQRXLB-AQPQCNDHSA-N
Data  5 IC50
  Tab Delimited (TSV)   2D SDfile   Computed 3D by Vconf -m prep SDfile
Find this compound or compounds like it in BindingDB:
Activity Spreadsheet -- Enzyme Inhibition Constant Data from BindingDB
Found 5 hits for monomerid = 50243577
TargetSomatostatin receptor type 5(Homo sapiens (Human))
University Of Berne
Curated by ChEMBL
LigandPNGBDBM50243577((4S)-N-(4-{[(4R,7S,10S,13R,16S,19S)-19-[(2R)-2-ami...)
Affinity DataIC50: >1.00E+3nM. Assay description: Displacement of [125I][LTT]SRIF28 from human cloned sst5 receptor by autoradiography
In DepthDetails ArticlePubMed
TargetSomatostatin receptor type 1(Homo sapiens (Human))
University Of Berne
Curated by ChEMBL
LigandPNGBDBM50243577((4S)-N-(4-{[(4R,7S,10S,13R,16S,19S)-19-[(2R)-2-ami...)
Affinity DataIC50: >1.00E+3nM. Assay description: Displacement of [125I][LTT]SRIF28 from human cloned sst1 receptor by autoradiography
In DepthDetails ArticlePubMed
TargetSomatostatin receptor type 4(Homo sapiens (Human))
University Of Berne
Curated by ChEMBL
LigandPNGBDBM50243577((4S)-N-(4-{[(4R,7S,10S,13R,16S,19S)-19-[(2R)-2-ami...)
Affinity DataIC50: >1.00E+3nM. Assay description: Displacement of [125I][LTT]SRIF28 from human cloned sst4 receptor by autoradiography
In DepthDetails ArticlePubMed
TargetSomatostatin receptor type 3(Homo sapiens (Human))
University Of Berne
Curated by ChEMBL
LigandPNGBDBM50243577((4S)-N-(4-{[(4R,7S,10S,13R,16S,19S)-19-[(2R)-2-ami...)
Affinity DataIC50:  8.30nM. Assay description: Displacement of [125I][LTT]SRIF28 from human cloned sst3 receptor by autoradiography
In DepthDetails ArticlePubMed
TargetSomatostatin receptor type 2(Homo sapiens (Human))
University Of Berne
Curated by ChEMBL
LigandPNGBDBM50243577((4S)-N-(4-{[(4R,7S,10S,13R,16S,19S)-19-[(2R)-2-ami...)
Affinity DataIC50:  2.40nM. Assay description: Displacement of [125I][LTT]SRIF28 from human cloned sst2 receptor by autoradiography
In DepthDetails ArticlePubMed