BDBM50244095 9-[(10R,20S,30R,50R)-30,40-Epoxy-20-hydroxy-cyclopentan-10-yl]-9-H-2-fluoroadenine::CHEMBL451781
SMILES Nc1nc(F)nc2n(cnc12)[C@@H]1C[C@H]2O[C@H]2[C@H]1O
InChI Key InChIKey=YJNQJIDFTZAUSB-ZCBVHYEASA-N
Data  1 KI
  Tab Delimited (TSV)   2D SDfile   Computed 3D by Vconf -m prep SDfile
Find this compound or compounds like it in BindingDB:
Activity Spreadsheet -- Enzyme Inhibition Constant Data from BindingDB
Found 1 hit for monomerid = 50244095
TargetAdenosylhomocysteinase(Homo sapiens (Human))
Gifu University
Curated by ChEMBL
LigandPNGBDBM50244095(9-[(10R,20S,30R,50R)-30,40-Epoxy-20-hydroxy-cyclop...)
Affinity DataKi:  2.03E+4nM. Assay description: Inhibition of human SAHH
In DepthDetails ArticlePubMed