BDBM50244109 1-amino-2-methylpropyl(isobutylcarbamothioyl)phosphinic acid::CHEMBL459660
SMILES CC(C)CNC(=S)P(O)(O)=C(N)C(C)C
InChI Key InChIKey=YEQUEWRYNQCGTR-UHFFFAOYSA-N
Data  1 IC50
  Tab Delimited (TSV)   2D SDfile   Computed 3D by Vconf -m prep SDfile
Find this compound or compounds like it in BindingDB:
Activity Spreadsheet -- Enzyme Inhibition Constant Data from BindingDB
Found 1 hit for monomerid = 50244109
TargetAminopeptidase N(Sus scrofa (Pig))
Wroc£?Aw University Of Technology
Curated by ChEMBL
LigandPNGBDBM50244109(1-amino-2-methylpropyl(isobutylcarbamothioyl)phosp...)
Affinity DataIC50:  1.90E+3nM. Assay description: Inhibition of pig kidney aminopeptidase N
In DepthDetails ArticlePubMed