BDBM50244495 CHEMBL4066176
SMILES C[C@@H]1CN(CCN1c1ccc(Nc2cc(cn(C)c2=O)-c2ccnc(N3CCn4c5CC(C)(C)Cc5cc4C3=O)c2CO)nc1)C1COC1
InChI Key InChIKey=WNEODWDFDXWOLU-HSZRJFAPSA-N
Data  1 KI  4 IC50  11 Kd
  Tab Delimited (TSV)   2D SDfile   Computed 3D by Vconf -m prep SDfile
Find this compound or compounds like it in BindingDB:
Activity Spreadsheet -- Enzyme Inhibition Constant Data from BindingDB
Found 16 hits for monomerid = 50244495
TargetTyrosine-protein kinase BTK(Homo sapiens (Human))
Genentech
Curated by ChEMBL
LigandPNGBDBM50244495(CHEMBL4066176)
Affinity DataKi:  1.80nM. Assay description: Inhibition of human recombinant C-terminal polyhistidine tagged BTK (1 to 659 residues)-mediated synthetic peptide substrate phosphorylation expresse...
In DepthDetails ArticlePubMed
TargetTyrosine-protein kinase BTK(Homo sapiens (Human))
Genentech
Curated by ChEMBL
LigandPNGBDBM50244495(CHEMBL4066176)
Affinity DataIC50: <1nM. Assay description: Inhibition of human BTK using fluorescein-labeled polyGAT peptide as substrate incubated for 30 mins by FRET assay
In DepthDetails ArticlePubMed
TargetTyrosine-protein kinase BTK(Homo sapiens (Human))
Genentech
Curated by ChEMBL
LigandPNGBDBM50244495(CHEMBL4066176)
Affinity DataIC50:  20nM. Assay description: Inhibition of BTK phosphorylation in human whole blood assessed as reduction in BTK phosphorylation incubated for 30 mins
In DepthDetails ArticlePubMed
TargetEarly activation antigen CD69(Homo sapiens)
Biogen
Curated by ChEMBL
LigandPNGBDBM50244495(CHEMBL4066176)
Affinity DataIC50:  40nM. Assay description: Inhibition of CD69 in human whole blood preincubated for 30 mins followed by anti-human IgD stimulation and measured after 18 to 22 hrs by flow cytom...
In DepthDetails ArticlePubMed
TargetTyrosine-protein kinase BTK(Homo sapiens (Human))
Genentech
Curated by ChEMBL
LigandPNGBDBM50244495(CHEMBL4066176)
Affinity DataKd:  0.240nM. Assay description: Binding affinity to wild-type human full length BTK (M1 to S659 residues) expressed in mammalian expression system by Kinomescan method
In DepthDetails ArticlePubMed
TargetReceptor tyrosine-protein kinase erbB-2(Homo sapiens (Human))
Biogen
Curated by ChEMBL
LigandPNGBDBM50244495(CHEMBL4066176)
Affinity DataKd:  3.00E+4nM. Assay description: Binding affinity to ERBB2 (unknown origin) assessed as dissociation constant by KINOMEscan analysis
In DepthDetails PubMed
TargetTyrosine-protein kinase TXK(Homo sapiens (Human))
Biogen
Curated by ChEMBL
LigandPNGBDBM50244495(CHEMBL4066176)
Affinity DataKd:  2.00E+3nM. Assay description: Binding affinity to TXK (unknown origin) assessed as dissociation constant by KINOMEscan analysis
In DepthDetails PubMed
TargetTyrosine-protein kinase Blk(Homo sapiens (Human))
Biogen
Curated by ChEMBL
LigandPNGBDBM50244495(CHEMBL4066176)
Affinity DataKd:  4.10E+3nM. Assay description: Binding affinity to BLK (unknown origin) assessed as dissociation constant by KINOMEscan analysis
In DepthDetails PubMed
TargetCytoplasmic tyrosine-protein kinase BMX(Homo sapiens (Human))
Biogen
Curated by ChEMBL
LigandPNGBDBM50244495(CHEMBL4066176)
Affinity DataKd:  120nM. Assay description: Binding affinity to BMX (unknown origin) assessed as dissociation constant by KINOMEscan analysis
In DepthDetails PubMed
TargetTyrosine-protein kinase BTK(Homo sapiens (Human))
Genentech
Curated by ChEMBL
LigandPNGBDBM50244495(CHEMBL4066176)
Affinity DataKd:  0.240nM. Assay description: Binding affinity to BTK (unknown origin) assessed as dissociation constant by KINOMEscan analysis
In DepthDetails PubMed
TargetEpidermal growth factor receptor(Homo sapiens (Human))
Biogen
Curated by ChEMBL
LigandPNGBDBM50244495(CHEMBL4066176)
Affinity DataKd:  3.00E+4nM. Assay description: Binding affinity to EGFR (unknown origin) assessed as dissociation constant by KINOMEscan analysis
In DepthDetails PubMed
TargetTyrosine-protein kinase ITK/TSK(Homo sapiens (Human))
Biogen
Curated by ChEMBL
LigandPNGBDBM50244495(CHEMBL4066176)
Affinity DataKd:  190nM. Assay description: Binding affinity to ITK (unknown origin) assessed as dissociation constant by KINOMEscan analysis
In DepthDetails PubMed
TargetTyrosine-protein kinase JAK3(Homo sapiens (Human))
Biogen
Curated by ChEMBL
LigandPNGBDBM50244495(CHEMBL4066176)
Affinity DataKd:  2.30E+4nM. Assay description: Binding affinity to JAK3 (unknown origin) assessed as dissociation constant by KINOMEscan analysis
In DepthDetails PubMed
TargetTyrosine-protein kinase Tec(Homo sapiens (Human))
Biogen
Curated by ChEMBL
LigandPNGBDBM50244495(CHEMBL4066176)
Affinity DataKd:  210nM. Assay description: Binding affinity to TEC (unknown origin) assessed as dissociation constant by KINOMEscan analysis
In DepthDetails PubMed
TargetTyrosine-protein kinase BTK(Homo sapiens (Human))
Genentech
Curated by ChEMBL
LigandPNGBDBM50244495(CHEMBL4066176)
Affinity DataIC50:  40nM. Assay description: Inhibition of BTK in human whole blood-derived CD19+ B cells assessed as suppression of anti-IgM stimulated-CD69 expression preincubated for 1 hr fol...
In DepthDetails ArticlePubMed
TargetReceptor tyrosine-protein kinase erbB-4(Homo sapiens (Human))
Biogen
Curated by ChEMBL
LigandPNGBDBM50244495(CHEMBL4066176)
Affinity DataKd:  3.00E+4nM. Assay description: Binding affinity to ERBB4 (unknown origin) assessed as dissociation constant by KINOMEscan analysis
In DepthDetails PubMed