BDBM50244613 3-(4-(4-Methylbenzoyl)piperazine-1-carbonyl)coumarin::CHEMBL507543
SMILES Cc1ccc(cc1)C(=O)N1CCN(CC1)C(=O)c1cc2ccccc2oc1=O
InChI Key InChIKey=PBZGGASMZRAVNA-UHFFFAOYSA-N
Data  1 IC50
  Tab Delimited (TSV)   2D SDfile   Computed 3D by Vconf -m prep SDfile
Find this compound or compounds like it in BindingDB:
Activity Spreadsheet -- Enzyme Inhibition Constant Data from BindingDB
Found 1 hit for monomerid = 50244613
TargetAcetylcholinesterase(Electrophorus electricus (Electric eel))
China Pharmaceutical University
Curated by ChEMBL
LigandPNGBDBM50244613(3-(4-(4-Methylbenzoyl)piperazine-1-carbonyl)coumar...)
Affinity DataIC50:  1.80E+4nM. Assay description: Inhibition of Electrophorus electricus brain AChE by Ellman's method
In DepthDetails ArticlePubMed