BDBM50245105 (2R,3S,4R,5R,6S)-2-(hydroxymethyl)-6-(3-(4-methylbenzyl)phenyl)tetrahydro-2H-pyran-3,4,5-triol::(2R,3S,4R,5R,6S)-2-Hydroxymethyl-6-[3-(4-methyl-benzyl)-phenyl]-tetrahydro-pyran-3,4,5-triol::CHEMBL488696
SMILES Cc1ccc(Cc2cccc(c2)[C@@H]2O[C@H](CO)[C@@H](O)[C@H](O)[C@H]2O)cc1
InChI Key InChIKey=KHFPHQJDPNKPJV-OBKDMQGPSA-N
Data  2 EC50
  Tab Delimited (TSV)   2D SDfile   Computed 3D by Vconf -m prep SDfile
Find this compound or compounds like it in BindingDB:
Activity Spreadsheet -- Enzyme Inhibition Constant Data from BindingDB
Found 2 hits for monomerid = 50245105
TargetSodium/glucose cotransporter 2(Homo sapiens (Human))
Bristol-Myers Squibb
Curated by ChEMBL
LigandPNGBDBM50245105((2R,3S,4R,5R,6S)-2-(hydroxymethyl)-6-(3-(4-methylb...)
Affinity DataEC50:  22nM. Assay description: Inhibition of human kidney SGLT2 assessed as renal glucose reabsorption
In DepthDetails ArticlePubMed
TargetSodium/glucose cotransporter 2(Homo sapiens (Human))
Bristol-Myers Squibb
Curated by ChEMBL
LigandPNGBDBM50245105((2R,3S,4R,5R,6S)-2-(hydroxymethyl)-6-(3-(4-methylb...)
Affinity DataEC50:  22nM. Assay description: Inhibition of human SGLT2 expressed in CHO cells assessed as intracellular accumulation of [14C]-alpha-methyl glucopyranoside
In DepthDetails ArticlePubMed