BDBM50245198 1-(((S)-1-(1-(3-ethoxyphenyl)-2-p-tolyl-1H-imidazole-4-carbonyl)-4-(quinolin-3-yl)piperazin-2-yl)methyl)-3-methylurea::CHEMBL446502
SMILES CCOc1cccc(c1)-n1cc(nc1-c1ccc(C)cc1)C(=O)N1CCN(C[C@@H]1CNC(=O)NC)c1cnc2ccccc2c1
InChI Key InChIKey=SBMWCMUUZHXSLA-LJAQVGFWSA-N
Data  1 IC50  1 EC50
  Tab Delimited (TSV)   2D SDfile   Computed 3D by Vconf -m prep SDfile
Find this compound or compounds like it in BindingDB:
Activity Spreadsheet -- Enzyme Inhibition Constant Data from BindingDB
Found 2 hits for monomerid = 50245198
TargetCholecystokinin receptor type A(Homo sapiens (Human))
Merck
Curated by ChEMBL
LigandPNGBDBM50245198(1-(((S)-1-(1-(3-ethoxyphenyl)-2-p-tolyl-1H-imidazo...)
Affinity DataEC50:  0.160nM. Assay description: Agonist activity at human CCK1 receptor
In DepthDetails ArticlePubMed
TargetCholecystokinin receptor type A(Homo sapiens (Human))
Merck
Curated by ChEMBL
LigandPNGBDBM50245198(1-(((S)-1-(1-(3-ethoxyphenyl)-2-p-tolyl-1H-imidazo...)
Affinity DataIC50:  0.560nM. Assay description: Inhibition of human CCK1 receptor
In DepthDetails ArticlePubMed