BDBM50245549 4-(2-Chlorophenyl)-6-(2,3-dihydroxypropyl)-9-hydroxypyrrolo[3,4-c]carbazole-1,3(2H,6H )-dione::CHEMBL520904
SMILES OCC(O)Cn1c2ccc(O)cc2c2c3C(=O)NC(=O)c3c(cc12)-c1ccccc1Cl
InChI Key InChIKey=UTNPHCAOJSTUCO-UHFFFAOYSA-N
Data  3 IC50
  Tab Delimited (TSV)   2D SDfile   Computed 3D by Vconf -m prep SDfile
Find this compound or compounds like it in BindingDB:
Activity Spreadsheet -- Enzyme Inhibition Constant Data from BindingDB
Found 3 hits for monomerid = 50245549
TargetSerine/threonine-protein kinase Chk1(Homo sapiens (Human))
University Of Auckland
Curated by ChEMBL
LigandPNGBDBM50245549(4-(2-Chlorophenyl)-6-(2,3-dihydroxypropyl)-9-hydro...)
Affinity DataIC50:  77nM. Assay description: Inhibition of Chk1 kinase assessed as GST-Cdc25 phosphorylation by Western blot determination
In DepthDetails ArticlePubMed
TargetWee1-like protein kinase(Homo sapiens (Human))
University Of Auckland
Curated by ChEMBL
LigandPNGBDBM50245549(4-(2-Chlorophenyl)-6-(2,3-dihydroxypropyl)-9-hydro...)
Affinity DataIC50:  23nM. Assay description: Inhibition of human Wee1 assessed as polyornithine-tyrosine copolymer phosphorylation
In DepthDetails ArticlePubMed
TargetProto-oncogene tyrosine-protein kinase Src(Homo sapiens (Human))
University Of Auckland
Curated by ChEMBL
LigandPNGBDBM50245549(4-(2-Chlorophenyl)-6-(2,3-dihydroxypropyl)-9-hydro...)
Affinity DataIC50:  2.50E+3nM. Assay description: Inhibition of c-Src
In DepthDetails ArticlePubMed