BDBM50245834 4-((2R,4aR,6S,7R,8S,8aS)-7,8-dihydroxy-2-phenyl-hexahydropyrano[3,2-d][1,3]dioxin-6-yloxy)benzaldehyde::CHEMBL455398
SMILES O[C@@H]1[C@H](O)[C@@H]2O[C@@H](OC[C@H]2O[C@H]1Oc1ccc(C=O)cc1)c1ccccc1
InChI Key InChIKey=DBOHPVYLFFOFEU-DNDRQTMDSA-N
Data  1 IC50
  Tab Delimited (TSV)   2D SDfile   Computed 3D by Vconf -m prep SDfile
Find this compound or compounds like it in BindingDB:
Activity Spreadsheet -- Enzyme Inhibition Constant Data from BindingDB
Found 1 hit for monomerid = 50245834
TargetPolyphenol oxidase 2(Agaricus bisporus (Common mushroom))
Sun Yat-Sen University
Curated by ChEMBL
LigandPNGBDBM50245834(4-((2R,4aR,6S,7R,8S,8aS)-7,8-dihydroxy-2-phenyl-he...)
Affinity DataIC50:  5.20E+4nM. Assay description: Inhibition of mushroom tyrosinase assessed as 3,4-dihydroxy-L-phenylalanine oxidation
In DepthDetails ArticlePubMed