BDBM50246451 (rel)-methyl (8-(bis(2-chlorophenyl)methyl)-3-phenyl-8-aza-bicyclo[3.2.1]octan-3-yl)methylcarbamate::CHEMBL454650
SMILES COC(=O)NCC1(C[C@@H]2CC[C@@H](C1)N2C(c1ccccc1Cl)c1ccccc1Cl)c1ccccc1
InChI Key InChIKey=MZKLGGMSURIMAQ-VXKWHMMOSA-N
Data  2 KI
  Tab Delimited (TSV)   2D SDfile   Computed 3D by Vconf -m prep SDfile
Find this compound or compounds like it in BindingDB:
Activity Spreadsheet -- Enzyme Inhibition Constant Data from BindingDB
Found 2 hits for monomerid = 50246451
TargetNociceptin receptor(Homo sapiens (Human))
Schering-Plough Research Institute
Curated by ChEMBL
LigandPNGBDBM50246451((rel)-methyl (8-(bis(2-chlorophenyl)methyl)-3-phen...)
Affinity DataKi:  20nM. Assay description: Displacement of [125I][Tyr14]nociceptin FQ from human cloned nociceptin receptor expressed in CHO cells
In DepthDetails ArticlePubMed
TargetMu-type opioid receptor(Homo sapiens (Human))
Schering-Plough Research Institute
Curated by ChEMBL
LigandPNGBDBM50246451((rel)-methyl (8-(bis(2-chlorophenyl)methyl)-3-phen...)
Affinity DataKi:  905nM. Assay description: Displacement of [3H]diprenorphine from human mu opioid receptor expressed in CHO cells
In DepthDetails ArticlePubMed