BDBM50246865 CHEMBL4077880
SMILES COc1ccc(cc1OCc1ccccc1Cl)C(=O)NO
InChI Key InChIKey=XHSHTLBWVLRZMI-UHFFFAOYSA-N
Data  1 IC50
  Tab Delimited (TSV)   2D SDfile   Computed 3D by Vconf -m prep SDfile
Find this compound or compounds like it in BindingDB:
Activity Spreadsheet -- Enzyme Inhibition Constant Data from BindingDB
Found 1 hit for monomerid = 50246865
TargetHistone deacetylase 8(Homo sapiens (Human))
Martin-Luther University Of Halle-Wittenberg
Curated by ChEMBL
LigandPNGBDBM50246865(CHEMBL4077880)
Affinity DataIC50:  120nM. Assay description: Inhibition of recombinant human full length C-terminal His-tagged HDAC8 expressed in Escherichia coli BL21(DE3) using fluor de Lys(R) as substrate af...
In DepthDetails ArticlePubMed