BDBM50246947 5-[(E)-2-Phenylvinyl]-3-bromo-2-hydroxybenzoic acid::CHEMBL453899
SMILES OC(=O)c1cc(\C=C\c2ccccc2)cc(Br)c1O
InChI Key InChIKey=BDZVGZBNKUIMGL-VOTSOKGWSA-N
Data  3 IC50
  Tab Delimited (TSV)   2D SDfile   Computed 3D by Vconf -m prep SDfile
Find this compound or compounds like it in BindingDB:
Activity Spreadsheet -- Enzyme Inhibition Constant Data from BindingDB
Found 3 hits for monomerid = 50246947
TargetTyrosine-protein phosphatase non-receptor type 1(Homo sapiens (Human))
Inha University
Curated by ChEMBL
LigandPNGBDBM50246947(5-[(E)-2-Phenylvinyl]-3-bromo-2-hydroxybenzoic aci...)
Affinity DataIC50:  3.00E+4nM. Assay description: Inhibition of PTP1B (unknown origin)
In DepthDetails ArticlePubMed
TargetTyrosine-protein phosphatase non-receptor type 6(Homo sapiens (Human))
Inha University
Curated by ChEMBL
LigandPNGBDBM50246947(5-[(E)-2-Phenylvinyl]-3-bromo-2-hydroxybenzoic aci...)
Affinity DataIC50:  1.40E+5nM. Assay description: Inhibition of PTP SHP1 (unknown origin)
In DepthDetails ArticlePubMed
TargetTyrosine-protein phosphatase non-receptor type 2(Homo sapiens (Human))
Inha University
Curated by ChEMBL
LigandPNGBDBM50246947(5-[(E)-2-Phenylvinyl]-3-bromo-2-hydroxybenzoic aci...)
Affinity DataIC50:  1.73E+5nM. Assay description: Inhibition of TC-PTP (unknown origin)
In DepthDetails ArticlePubMed