BDBM50246985 CHEMBL507704::benzyl (S)-6-amino-1-((S)-1-((S)-6-amino-1-(benzo[d]oxazol-2-yl)-1-oxohexan-2-ylamino)-4-methyl-1-oxopentan-2-ylamino)-1-oxohexan-2-ylcarbamate
SMILES CC(C)C[C@H](NC(=O)[C@H](CCCCN)NC(=O)OCc1ccccc1)C(=O)N[C@@H](CCCCN)C(=O)c1nc2ccccc2o1
InChI Key InChIKey=DNPQZCJIMHBDDX-QKDODKLFSA-N
Data  1 KI
  Tab Delimited (TSV)   2D SDfile   Computed 3D by Vconf -m prep SDfile
Find this compound or compounds like it in BindingDB:
Activity Spreadsheet -- Enzyme Inhibition Constant Data from BindingDB
Found 1 hit for monomerid = 50246985
TargetProstasin(Homo sapiens (Human))
Genomics Institute Of The Novartis Research Foundation
Curated by ChEMBL
LigandPNGBDBM50246985(CHEMBL507704 | benzyl (S)-6-amino-1-((S)-1-((S)-6-...)
Affinity DataKi:  1.52E+4nM. Assay description: Binding affinity to human prostasin
In DepthDetails ArticlePubMed