BDBM50247003 CHEMBL501945::{(R)-1-[(2S,4R)-2-[(S)-5-Amino-1-(benzooxazole-2-carbonyl)-pentylcarbamoyl]-4-(4-methanesulfonyl-benzylcarbamoyloxy)-pyrrolidine-1-carbonyl]-3-phenyl-propyl}-carbamic acid benzyl ester
SMILES CS(=O)(=O)c1ccc(CNC(=O)O[C@@H]2C[C@H](N(C2)C(=O)[C@@H](CCc2ccccc2)NC(=O)OCc2ccccc2)C(=O)N[C@@H](CCCCN)C(=O)c2nc3ccccc3o2)cc1
InChI Key InChIKey=WGECDQPZAHBMBX-FJWQMDKSSA-N
Data  1 KI
  Tab Delimited (TSV)   2D SDfile   Computed 3D by Vconf -m prep SDfile
Find this compound or compounds like it in BindingDB:
Activity Spreadsheet -- Enzyme Inhibition Constant Data from BindingDB
Found 1 hit for monomerid = 50247003
TargetProstasin(Homo sapiens (Human))
Genomics Institute Of The Novartis Research Foundation
Curated by ChEMBL
LigandPNGBDBM50247003(CHEMBL501945 | {(R)-1-[(2S,4R)-2-[(S)-5-Amino-1-(b...)
Affinity DataKi:  176nM. Assay description: Binding affinity to human prostasin
In DepthDetails ArticlePubMed