BDBM50247067 2beta-Carbo(2-fluoroethoxy)-3beta-(3'-((E)-2-iodoethenyl)phenyl)-nortropane::CHEMBL516825
SMILES FCCOC(=O)C1C2CCC(CC1c1cccc(\C=C\I)c1)N2
InChI Key InChIKey=MBCIBUXZJAIISR-SOFGYWHQSA-N
Data  3 KI
  Tab Delimited (TSV)   2D SDfile   Computed 3D by Vconf -m prep SDfile
Find this compound or compounds like it in BindingDB:
Activity Spreadsheet -- Enzyme Inhibition Constant Data from BindingDB
Found 3 hits for monomerid = 50247067
TargetSodium-dependent serotonin transporter(Homo sapiens (Human))
Emory University
Curated by ChEMBL
LigandPNGBDBM50247067(2beta-Carbo(2-fluoroethoxy)-3beta-(3'-((E)-2-iodoe...)
Affinity DataKi:  15.2nM. Assay description: Displacement of [3H](R,S)citalopram.HBr from human SERT transfected in human HEK293 cells
In DepthDetails ArticlePubMed
TargetSodium-dependent dopamine transporter(Homo sapiens (Human))
Emory University
Curated by ChEMBL
LigandPNGBDBM50247067(2beta-Carbo(2-fluoroethoxy)-3beta-(3'-((E)-2-iodoe...)
Affinity DataKi:  274nM. Assay description: Displacement of [3H]RTI-55 from human DAT transfected in human HEK293 cells
In DepthDetails ArticlePubMed
TargetSodium-dependent noradrenaline transporter(Homo sapiens (Human))
Emory University
Curated by ChEMBL
LigandPNGBDBM50247067(2beta-Carbo(2-fluoroethoxy)-3beta-(3'-((E)-2-iodoe...)
Affinity DataKi:  1.18E+3nM. Assay description: Displacement of [3H]nisoxetine from human NET transfected in human HEK293 cells
In DepthDetails ArticlePubMed