BDBM50247099 1,3-dicyclohexyl-2-(((E)-3-methyl-2-(methylimino)-2,3-dihydrothiazol-4-yl)methyl)isothiourea::CHEMBL460484
SMILES C\N=c1\scc(CS\C(NC2CCCCC2)=N/C2CCCCC2)n1C
InChI Key InChIKey=KLLMZMYFAATCQU-FMQUCBEESA-N
Data  2 IC50
  Tab Delimited (TSV)   2D SDfile   Computed 3D by Vconf -m prep SDfile
Find this compound or compounds like it in BindingDB:
Activity Spreadsheet -- Enzyme Inhibition Constant Data from BindingDB
Found 2 hits for monomerid = 50247099
TargetC-X-C chemokine receptor type 4(Homo sapiens (Human))
Novartis Institutes For Biomedical Research
Curated by ChEMBL
LigandPNGBDBM50247099(1,3-dicyclohexyl-2-(((E)-3-methyl-2-(methylimino)-...)
Affinity DataIC50:  9.13E+3nM. Assay description: Activity at CXCR4 in human CEM cells assessed as inhibition of CXCL12-induced calcium mobilization
In DepthDetails ArticlePubMed
TargetC-X-C chemokine receptor type 4(Homo sapiens (Human))
Novartis Institutes For Biomedical Research
Curated by ChEMBL
LigandPNGBDBM50247099(1,3-dicyclohexyl-2-(((E)-3-methyl-2-(methylimino)-...)
Affinity DataIC50: >1.00E+4nM. Assay description: Displacement of [125I]CXCL12 from CXCR4 in human CEM cells
In DepthDetails ArticlePubMed