BDBM50247100 1-(4-[N-(2-Benzylamino-2-oxoethylcarbamoyl]aminomethyl]-3-methylbenzoyl)-2,3,4,5-tetrahydro-1H-1-benzazepine::CHEMBL460308
SMILES Cc1cc(ccc1CNC(=O)NCC(=O)NCc1ccccc1)C(=O)N1CCCCc2ccccc12
InChI Key InChIKey=ZDHIWGZGBDRYPJ-UHFFFAOYSA-N
Data  1 EC50
  Tab Delimited (TSV)   2D SDfile   Computed 3D by Vconf -m prep SDfile
Find this compound or compounds like it in BindingDB:
Activity Spreadsheet -- Enzyme Inhibition Constant Data from BindingDB
Found 1 hit for monomerid = 50247100
TargetVasopressin V2 receptor(Homo sapiens (Human))
Vantia
Curated by ChEMBL
LigandPNGBDBM50247100(1-(4-[N-(2-Benzylamino-2-oxoethylcarbamoyl]aminome...)
Affinity DataEC50:  270nM. Assay description: Agonist activity at human vasopressin V2 receptor expressed in HEK293 cells assessed as increase in intracellular cAMP level by CRE-luciferase report...
In DepthDetails ArticlePubMed