BDBM50247119 (2-butylbenzofuran-3-yl)(4-(2-(ethylamino)ethoxy)-3-iodophenyl)methanone::CHEMBL447626
SMILES CCCCc1oc2ccccc2c1C(=O)c1ccc(OCCNCC)c(I)c1
InChI Key InChIKey=CFVCYTDXVQNGLP-UHFFFAOYSA-N
Data  1 EC50
  Tab Delimited (TSV)   2D SDfile   Computed 3D by Vconf -m prep SDfile
Find this compound or compounds like it in BindingDB:
Activity Spreadsheet -- Enzyme Inhibition Constant Data from BindingDB
Found 1 hit for monomerid = 50247119
TargetTrace amine-associated receptor 1(Rattus norvegicus (Rat))
University Of California San Francisco
Curated by ChEMBL
LigandPNGBDBM50247119((2-butylbenzofuran-3-yl)(4-(2-(ethylamino)ethoxy)-...)
Affinity DataEC50:  33nM. Assay description: Antagonist activity at rat TAAR1 expressed in HEK293 cells assessed as intracellular cAMP level
In DepthDetails ArticlePubMed