BDBM50247254 1-(2-chloro-2-phenylethyl)-N6,N6-dimethyl-N4-propyl-1H-pyrazolo[3,4-d]pyrimidine-4,6-diamine::CHEMBL473727
SMILES CCCNc1nc(nc2n(CC(Cl)c3ccccc3)ncc12)N(C)C
InChI Key InChIKey=ORSJMRYJQKLLEC-UHFFFAOYSA-N
Data  2 KI
  Tab Delimited (TSV)   2D SDfile   Computed 3D by Vconf -m prep SDfile
Find this compound or compounds like it in BindingDB:
Activity Spreadsheet -- Enzyme Inhibition Constant Data from BindingDB
Found 2 hits for monomerid = 50247254
TargetTyrosine-protein kinase ABL1(Homo sapiens (Human))
Università
Curated by ChEMBL
LigandPNGBDBM50247254(1-(2-chloro-2-phenylethyl)-N6,N6-dimethyl-N4-propy...)
Affinity DataKi:  320nM. Assay description: Inhibition of human recombinant Abl by filter-binding assay
In DepthDetails ArticlePubMed
TargetProto-oncogene tyrosine-protein kinase Src(Homo sapiens (Human))
Università
Curated by ChEMBL
LigandPNGBDBM50247254(1-(2-chloro-2-phenylethyl)-N6,N6-dimethyl-N4-propy...)
Affinity DataKi:  4.10E+3nM. Assay description: Inhibition of human recombinant c-Src by filter-binding assay
In DepthDetails ArticlePubMed