BDBM50247388 1-(2-bromo-2-phenylethyl)-6-(methylthio)-4-(pyrrolidin-1-yl)-1H-pyrazolo[3,4-d]pyrimidine::CHEMBL507594
SMILES CSc1nc(N2CCCC2)c2cnn(CC(Br)c3ccccc3)c2n1
InChI Key InChIKey=XZWVDSXWDSIELQ-UHFFFAOYSA-N
Data  2 KI
  Tab Delimited (TSV)   2D SDfile   Computed 3D by Vconf -m prep SDfile
Find this compound or compounds like it in BindingDB:
Activity Spreadsheet -- Enzyme Inhibition Constant Data from BindingDB
Found 2 hits for monomerid = 50247388
TargetTyrosine-protein kinase ABL1(Homo sapiens (Human))
Università
Curated by ChEMBL
LigandPNGBDBM50247388(1-(2-bromo-2-phenylethyl)-6-(methylthio)-4-(pyrrol...)
Affinity DataKi:  1.40E+3nM. Assay description: Inhibition of human recombinant Abl by filter-binding assay
In DepthDetails ArticlePubMed
TargetProto-oncogene tyrosine-protein kinase Src(Homo sapiens (Human))
Università
Curated by ChEMBL
LigandPNGBDBM50247388(1-(2-bromo-2-phenylethyl)-6-(methylthio)-4-(pyrrol...)
Affinity DataKi:  1.63E+3nM. Assay description: Inhibition of human recombinant c-Src by filter-binding assay
In DepthDetails ArticlePubMed