BDBM50247646 2-[1'-(4-Methoxyphenyl)-3'-furyl-2'-propenylidene]hydrazine-3-methyl-4(3H)-quinazolinone::CHEMBL454160
SMILES COc1ccc(cc1)C(=CCc1ccco1)N=Nc1nc2ccccc2c(=O)n1C
InChI Key InChIKey=MRHLPBFSNCNLFL-UHFFFAOYSA-N
Data  2 KI  2 IC50
  Tab Delimited (TSV)   2D SDfile   Computed 3D by Vconf -m prep SDfile
Find this compound or compounds like it in BindingDB:
Activity Spreadsheet -- Enzyme Inhibition Constant Data from BindingDB
Found 4 hits for monomerid = 50247646
TargetAmine oxidase [flavin-containing] A(Rattus norvegicus (rat))
Hacettepe University
Curated by ChEMBL
LigandPNGBDBM50247646(2-[1'-(4-Methoxyphenyl)-3'-furyl-2'-propenylidene]...)
Affinity DataKi:  7.03E+4nM. Assay description: Inhibition of MAO-A in rat liver homogenate after 60 mins by Lineweaver-Burk plot
In DepthDetails ArticlePubMed
TargetAmine oxidase [flavin-containing] B(Rattus norvegicus (rat))
Hacettepe University
Curated by ChEMBL
LigandPNGBDBM50247646(2-[1'-(4-Methoxyphenyl)-3'-furyl-2'-propenylidene]...)
Affinity DataKi:  9.06E+4nM. Assay description: Inhibition of MAO-B in rat liver homogenate after 60 mins by Lineweaver-Burk plot
In DepthDetails ArticlePubMed
TargetAmine oxidase [flavin-containing] A(Rattus norvegicus (rat))
Hacettepe University
Curated by ChEMBL
LigandPNGBDBM50247646(2-[1'-(4-Methoxyphenyl)-3'-furyl-2'-propenylidene]...)
Affinity DataIC50:  3.42E+4nM. Assay description: Inhibition of MAO-A in rat liver homogenate after 60 mins by residual activity plot
In DepthDetails ArticlePubMed
TargetAmine oxidase [flavin-containing] B(Rattus norvegicus (rat))
Hacettepe University
Curated by ChEMBL
LigandPNGBDBM50247646(2-[1'-(4-Methoxyphenyl)-3'-furyl-2'-propenylidene]...)
Affinity DataIC50:  4.19E+5nM. Assay description: Inhibition of MAO-B in rat liver homogenate after 60 mins by residual activity plot
In DepthDetails ArticlePubMed