BDBM50247680 (-)-3-chlorophenyl (3S,4R)-6-cyano-3-hydroxy-2,2-dimethylchroman-4-ylcarbamate::CHEMBL455408
SMILES CC1(C)Oc2ccc(cc2[C@@H](NC(=O)c2cccc(Cl)c2)[C@@H]1O)C#N
InChI Key InChIKey=NCSBMDAOMUEETK-SJORKVTESA-N
Data  1 EC50
  Tab Delimited (TSV)   2D SDfile   Computed 3D by Vconf -m prep SDfile
Find this compound or compounds like it in BindingDB:
Activity Spreadsheet -- Enzyme Inhibition Constant Data from BindingDB
Found 1 hit for monomerid = 50247680
TargetATP-binding cassette sub-family C member 9(Homo sapiens (Human))
Johnson & Johnson Pharmaceutical Research And Development
Curated by ChEMBL
LigandPNGBDBM50247680((-)-3-chlorophenyl (3S,4R)-6-cyano-3-hydroxy-2,2-d...)
Affinity DataEC50:  70nM. Assay description: Channel opening activity at SUR2B/Kir6.2 potassium ATP channel in human TE671 cells assessed as isometric force by FLIPR
In DepthDetails ArticlePubMed