BDBM50247724 (3S,4R)-4-[2-(4-Chloro-phenyl)-imidazol-1-yl]-3-hydroxy-2,2-dimethyl-chroman-6-carbonitrile::CHEMBL449849
SMILES CC1(C)Oc2ccc(cc2[C@H]([C@@H]1O)n1ccnc1-c1ccc(Cl)cc1)C#N
InChI Key InChIKey=RPJHOXWULXUNQZ-MOPGFXCFSA-N
Data  1 EC50
  Tab Delimited (TSV)   2D SDfile   Computed 3D by Vconf -m prep SDfile
Find this compound or compounds like it in BindingDB:
Activity Spreadsheet -- Enzyme Inhibition Constant Data from BindingDB
Found 1 hit for monomerid = 50247724
TargetATP-binding cassette sub-family C member 9(Homo sapiens (Human))
Johnson & Johnson Pharmaceutical Research And Development
Curated by ChEMBL
LigandPNGBDBM50247724((3S,4R)-4-[2-(4-Chloro-phenyl)-imidazol-1-yl]-3-hy...)
Affinity DataEC50:  2.75E+3nM. Assay description: Channel opening activity at SUR2B/Kir6.2 potassium ATP channel in human TE671 cells assessed as isometric force by FLIPR
In DepthDetails ArticlePubMed