BDBM50247765 (3S,4R) 4-[5-(4-Chloro-phenyl)-imidazol-1-yl]-2,2-dimethyl-3,4-dihydro-2H-pyrano[3,2-c]pyridin-3-ol::CHEMBL460911
SMILES CC1(C)Oc2ccncc2[C@H]([C@@H]1O)n1cncc1-c1ccc(Cl)cc1
InChI Key InChIKey=GHWMDGOTRVWMKW-MSOLQXFVSA-N
Data  1 EC50
  Tab Delimited (TSV)   2D SDfile   Computed 3D by Vconf -m prep SDfile
Find this compound or compounds like it in BindingDB:
Activity Spreadsheet -- Enzyme Inhibition Constant Data from BindingDB
Found 1 hit for monomerid = 50247765
TargetATP-binding cassette sub-family C member 9(Homo sapiens (Human))
Johnson & Johnson Pharmaceutical Research And Development
Curated by ChEMBL
LigandPNGBDBM50247765((3S,4R) 4-[5-(4-Chloro-phenyl)-imidazol-1-yl]-2,2-...)
Affinity DataEC50:  1.38E+4nM. Assay description: Channel opening activity at SUR2B/Kir6.2 potassium ATP channel in human TE671 cells assessed as isometric force by FLIPR
In DepthDetails ArticlePubMed