BDBM50247818 (3S,4R)-2-(6-Benzenesulfonyl-3-hydroxy-2,2-dimethylchroman-4-yl)-5-chloro-4-benzo[d] isoxazol-3-one::CHEMBL514789
SMILES CC1(C)Oc2ccc(cc2[C@H]([C@@H]1O)n1oc2ccc(Cl)cc2c1=O)S(=O)(=O)c1ccccc1
InChI Key InChIKey=OFJWJKKXIPNEFE-YADHBBJMSA-N
Data  1 EC50
  Tab Delimited (TSV)   2D SDfile   Computed 3D by Vconf -m prep SDfile
Find this compound or compounds like it in BindingDB:
Activity Spreadsheet -- Enzyme Inhibition Constant Data from BindingDB
Found 1 hit for monomerid = 50247818
TargetATP-binding cassette sub-family C member 9(Homo sapiens (Human))
Johnson & Johnson Pharmaceutical Research And Development
Curated by ChEMBL
LigandPNGBDBM50247818((3S,4R)-2-(6-Benzenesulfonyl-3-hydroxy-2,2-dimethy...)
Affinity DataEC50:  1.56E+3nM. Assay description: Channel opening activity at SUR2B/Kir6.2 potassium ATP channel in human TE671 cells assessed as isometric force by FLIPR
In DepthDetails ArticlePubMed