BDBM50247858 (3S,4R)-6-Chloro-[2-hydroxy-6-(4-methoxy-benzenesulfonyl)-2,2-dimethyl-chroman-4-yl]-benzo[d]isoxazol-3-one::CHEMBL491281
SMILES COc1ccc(cc1)S(=O)(=O)c1ccc2OC(C)(C)[C@@H](O)[C@@H](c2c1)n1oc2cc(Cl)ccc2c1=O
InChI Key InChIKey=MUWPSWHMNVWJOX-PKTZIBPZSA-N
Data  1 EC50
  Tab Delimited (TSV)   2D SDfile   Computed 3D by Vconf -m prep SDfile
Find this compound or compounds like it in BindingDB:
Activity Spreadsheet -- Enzyme Inhibition Constant Data from BindingDB
Found 1 hit for monomerid = 50247858
TargetATP-binding cassette sub-family C member 9(Homo sapiens (Human))
Johnson & Johnson Pharmaceutical Research And Development
Curated by ChEMBL
LigandPNGBDBM50247858((3S,4R)-6-Chloro-[2-hydroxy-6-(4-methoxy-benzenesu...)
Affinity DataEC50:  7.33E+3nM. Assay description: Channel opening activity at SUR2B/Kir6.2 potassium ATP channel in human TE671 cells assessed as isometric force by FLIPR
In DepthDetails ArticlePubMed