BDBM50247872 CHEMBL4098680
SMILES CC(CCNc1ccnc2cc(Cl)ccc12)NCC12CC3CC(CC(C3)C1)C2
InChI Key InChIKey=PLBFCKVOSBPVBS-UHFFFAOYSA-N
Data  1 IC50
  Tab Delimited (TSV)   2D SDfile   Computed 3D by Vconf -m prep SDfile
Find this compound or compounds like it in BindingDB:
Activity Spreadsheet -- Enzyme Inhibition Constant Data from BindingDB
Found 1 hit for monomerid = 50247872
TargetBotulinum neurotoxin type A(Clostridium botulinum)
University Of Belgrade
Curated by ChEMBL
LigandPNGBDBM50247872(CHEMBL4098680)
Affinity DataIC50:  2.70E+3nM. Assay description: Inhibition of Clostridium botulinum BoNT/A light chain using P39 as substrate preincubated for 10 mins followed by substrate addition measured after ...
In DepthDetails ArticlePubMed