BDBM50247883 CHEBI:28934::Calciferol::Calciferol In Arach Oil::Caltrate::D-Forte::Deltalin::Drisdol::Eciferol D2::Ergo-D2::Ergocalciferol::Ergoral D2::Lanes::Oleovitamin D::Oleovitamin D, Synthetic::Osto-D2::Sterogyl::Sterogyl 15H::Sterogyl-15::Uvesterol D::Viosterol in Oil::Vitamin D::Vitamin D 2::Vitamin D2
SMILES [H][C@@]1(CC[C@@]2([H])\C(CCC[C@]12C)=C\C=C1\C[C@@H](O)CCC1=C)[C@H](C)\C=C\[C@H](C)C(C)C
InChI Key InChIKey=MECHNRXZTMCUDQ-RKHKHRCZSA-N
Data  9 IC50
PDB links: 1 PDB ID matches this monomer.
  Tab Delimited (TSV)   2D SDfile   Computed 3D by Vconf -m prep SDfile
Find this compound or compounds like it in BindingDB:
Activity Spreadsheet -- Enzyme Inhibition Constant Data from BindingDB
Found 9 hits for monomerid = 50247883
TargetBile salt export pump(Homo sapiens (Human))
Amgen
Curated by ChEMBL
LigandPNGBDBM50247883(CHEBI:28934 | Calciferol | Calciferol In Arach Oil...)
Affinity DataIC50:  7.58E+4nM. Assay description: Inhibition of human BSEP overexpressed in Sf9 cell membrane vesicles assessed as uptake of [3H]-taurocholate in presence of ATP measured after 15 to ...
In DepthDetails ArticlePubMed
TargetATP-binding cassette sub-family C member 4(Homo sapiens (Human))
Amgen
Curated by ChEMBL
LigandPNGBDBM50247883(CHEBI:28934 | Calciferol | Calciferol In Arach Oil...)
Affinity DataIC50: >1.33E+5nM. Assay description: Inhibition of human MRP4 overexpressed in Sf9 cell membrane vesicles assessed as uptake of [3H]-estradiol-17beta-D-glucuronide in presence of ATP and...
In DepthDetails ArticlePubMed
TargetATP-binding cassette sub-family C member 2(Homo sapiens (Human))
Amgen
Curated by ChEMBL
LigandPNGBDBM50247883(CHEBI:28934 | Calciferol | Calciferol In Arach Oil...)
Affinity DataIC50: >1.33E+5nM. Assay description: Inhibition of human MRP2 overexpressed in Sf9 cell membrane vesicles assessed as uptake of [3H]-estradiol-17beta-D-glucuronide in presence of ATP and...
In DepthDetails ArticlePubMed
TargetATP-binding cassette sub-family C member 3(Homo sapiens (Human))
Amgen
Curated by ChEMBL
LigandPNGBDBM50247883(CHEBI:28934 | Calciferol | Calciferol In Arach Oil...)
Affinity DataIC50: >1.33E+5nM. Assay description: Inhibition of human MRP3 overexpressed in Sf9 insect cell membrane vesicles assessed as uptake of [3H]-estradiol-17beta-D-glucuronide in presence of ...
In DepthDetails ArticlePubMed
TargetThiosulfate sulfurtransferase(Homo sapiens)
Indiana University School Of Medicine
Curated by ChEMBL
LigandPNGBDBM50247883(CHEBI:28934 | Calciferol | Calciferol In Arach Oil...)
Affinity DataIC50:  9.40E+4nM. Assay description: Inhibition of native rhodanese (unknown origin) assessed as reduction in rhodanese enzyme activity after 45 mins by Fe(SCN)3 dye based spectrometric ...
In DepthDetails ArticlePubMed
TargetCo-chaperonin GroES(Escherichia coli)
Indiana University School Of Medicine
Curated by ChEMBL
LigandPNGBDBM50247883(CHEBI:28934 | Calciferol | Calciferol In Arach Oil...)
Affinity DataIC50:  4.10E+4nM. Assay description: Inhibition of Escherichia coli GroEL expressed in Escherichia coli DH5alpha/Escherichia coli GroES expressed in Escherichia coli BL21 (DE3) assessed ...
In DepthDetails ArticlePubMed
Target60 kDa heat shock protein, mitochondrial(Homo sapiens)
Indiana University School Of Medicine
Curated by ChEMBL
LigandPNGBDBM50247883(CHEBI:28934 | Calciferol | Calciferol In Arach Oil...)
Affinity DataIC50:  4.50E+4nM. Assay description: Inhibition of human N-terminal octa-His-tagged HSP60 expressed in Escherichia coli Rosetta(DE3) pLysS/human HSP10 expressed in Escherichia coli Roset...
In DepthDetails ArticlePubMed
TargetChaperonin GroEL(Escherichia coli)
Indiana University School Of Medicine
Curated by ChEMBL
LigandPNGBDBM50247883(CHEBI:28934 | Calciferol | Calciferol In Arach Oil...)
Affinity DataIC50: >2.50E+5nM. Assay description: Inhibition of ATPase activity of Escherichia coli GroEL expressed in Escherichia coliDH5alpha incubated for 60 mins using ATP by spectrometric analys...
In DepthDetails ArticlePubMed
TargetCo-chaperonin GroES(Escherichia coli)
Indiana University School Of Medicine
Curated by ChEMBL
LigandPNGBDBM50247883(CHEBI:28934 | Calciferol | Calciferol In Arach Oil...)
Affinity DataIC50:  2.80E+4nM. Assay description: Inhibition of Escherichia coli GroEL expressed in Escherichia coliDH5alpha/Escherichia coli GroES expressed in Escherichia coli BL21 (DE3) assessed a...
In DepthDetails ArticlePubMed