BDBM50247936 4-(3-chloro-5-(4-(2-fluoro-3-(trifluoromethyl)phenyl)thiazol-2-ylcarbamoyl)pyridin-2-yl)piperazine-2-carboxylic acid::CHEMBL490096
SMILES OC(=O)C1CN(CCN1)c1ncc(cc1Cl)C(=O)Nc1nc(cs1)-c1cccc(c1F)C(F)(F)F
InChI Key InChIKey=MXODOOPIHHLFNH-UHFFFAOYSA-N
Data  1 EC50
  Tab Delimited (TSV)   2D SDfile   Computed 3D by Vconf -m prep SDfile
Find this compound or compounds like it in BindingDB:
Activity Spreadsheet -- Enzyme Inhibition Constant Data from BindingDB
Found 1 hit for monomerid = 50247936
TargetThrombopoietin receptor(Homo sapiens (Human))
Pfizer
Curated by ChEMBL
LigandPNGBDBM50247936(4-(3-chloro-5-(4-(2-fluoro-3-(trifluoromethyl)phen...)
Affinity DataEC50:  129nM. Assay description: Agonist activity at human thrombopoietin receptor transfected in mouse BAF3 cells assessed as stimulation of beta lactamase activity incubated in dar...
In DepthDetails ArticlePubMed