BDBM50248 MLS000584792::N'-[(1E,2E)-3-(2-furyl)-2-methylprop-2-enylidene]-3-(2-naphthyl)-1H-pyrazole-5-carbohydrazide::N-[[(E)-3-(2-furanyl)-2-methylprop-2-enylidene]amino]-3-(2-naphthalenyl)-1H-pyrazole-5-carboxamide::N-[[(E)-3-(2-furyl)-2-methyl-prop-2-enylidene]amino]-3-(2-naphthyl)-1H-pyrazole-5-carboxamide::N-[[(E)-3-(furan-2-yl)-2-methyl-prop-2-enylidene]amino]-3-naphthalen-2-yl-1H-pyrazole-5-carboxamide::N-[[(E)-3-(furan-2-yl)-2-methylprop-2-enylidene]amino]-3-naphthalen-2-yl-1H-pyrazole-5-carboxamide::SMR000203755::cid_12005032
SMILES CC(C=NNC(=O)c1cc(n[nH]1)-c1ccc2ccccc2c1)=Cc1ccco1
InChI Key InChIKey=POPNZZMVWVZWBW-UHFFFAOYSA-N
Data  1 IC50
  Tab Delimited (TSV)   2D SDfile   Computed 3D by Vconf -m prep SDfile
Find this compound or compounds like it in BindingDB:
Activity Spreadsheet -- Enzyme Inhibition Constant Data from BindingDB
Found 1 hit for monomerid = 50248
TargetInduced myeloid leukemia cell differentiation protein Mcl-1(Homo sapiens (Human))
Emory University
Curated by PubChem BioAssay
LigandPNGBDBM50248(MLS000584792 | N'-[(1E,2E)-3-(2-furyl)-2-methy...)
Affinity DataIC50:  4.10E+3nM. Assay description: NIH Molecular Libraries Screening Centers Network [MLSCN] Emory Chemical Biology Discovery Center in MLSCN Assay provider: Nikolovska-Coleska, Univer...
In DepthDetails PCBioAssay