BDBM50248025 1-(2-chloro-4-(4-(2-fluoro-3-(trifluoromethyl)phenyl)thiazol-2-ylcarbamoyl)phenyl)piperidine-4-carboxylic acid::CHEMBL459687
SMILES OC(=O)C1CCN(CC1)c1ccc(cc1Cl)C(=O)Nc1nc(cs1)-c1cccc(c1F)C(F)(F)F
InChI Key InChIKey=CNOBXKONCGFNDV-UHFFFAOYSA-N
Data  1 EC50
  Tab Delimited (TSV)   2D SDfile   Computed 3D by Vconf -m prep SDfile
Find this compound or compounds like it in BindingDB:
Activity Spreadsheet -- Enzyme Inhibition Constant Data from BindingDB
Found 1 hit for monomerid = 50248025
TargetThrombopoietin receptor(Homo sapiens (Human))
Pfizer
Curated by ChEMBL
LigandPNGBDBM50248025(1-(2-chloro-4-(4-(2-fluoro-3-(trifluoromethyl)phen...)
Affinity DataEC50:  56nM. Assay description: Agonist activity at human thrombopoietin receptor transfected in mouse BAF3 cells assessed as stimulation of beta lactamase activity incubated in dar...
In DepthDetails ArticlePubMed