BDBM50248192 1-benzyl-2,3-dimethyl-1H-indole-7-carboxylic acid::CHEMBL515599
SMILES Cc1c(C)c2cccc(C(O)=O)c2n1Cc1ccccc1
InChI Key InChIKey=NSKDMNCONIAVGH-UHFFFAOYSA-N
Data  1 IC50
  Tab Delimited (TSV)   2D SDfile   Computed 3D by Vconf -m prep SDfile
Find this compound or compounds like it in BindingDB:
Activity Spreadsheet -- Enzyme Inhibition Constant Data from BindingDB
Found 1 hit for monomerid = 50248192
TargetFatty acid-binding protein, adipocyte(Homo sapiens (Human))
Biovitrum
Curated by ChEMBL
LigandPNGBDBM50248192(1-benzyl-2,3-dimethyl-1H-indole-7-carboxylic acid ...)
Affinity DataIC50:  3.60E+3nM. Assay description: Inhibition of human A-FABP by fluorescence polarization assay
In DepthDetails ArticlePubMed