BDBM50248220 CHEMBL473950::N-(diaminomethylene)-2-(2,3-dimethoxyphenyl)-5-methyl-1H-imidazole-4-carboxamide dimethanesulfonate
SMILES COc1cccc(-c2nc(C)c([nH]2)C(=O)NC(N)=N)c1OC
InChI Key InChIKey=MGEBVOUAQCYFFI-UHFFFAOYSA-N
Data  1 IC50
  Tab Delimited (TSV)   2D SDfile   Computed 3D by Vconf -m prep SDfile
Find this compound or compounds like it in BindingDB:
Activity Spreadsheet -- Enzyme Inhibition Constant Data from BindingDB
Found 1 hit for monomerid = 50248220
TargetSodium/hydrogen exchanger 1(Homo sapiens (Human))
Korea Research Institute Of Chemical Technology
Curated by ChEMBL
LigandPNGBDBM50248220(CHEMBL473950 | N-(diaminomethylene)-2-(2,3-dimetho...)
Affinity DataIC50: >3.00E+4nM. Assay description: Inhibition of human NHE1 expressed in PS120 cells assessed as imposed acidosis
In DepthDetails ArticlePubMed