BDBM50248343 5-(4-(2-(5-methyl-2-phenyloxazol-4-yl)ethoxy)benzyl)-2-phenyl-2H-1,2,3-triazole-4-carboxylic acid::CHEMBL474947
SMILES Cc1oc(nc1CCOc1ccc(Cc2nn(nc2C(O)=O)-c2ccccc2)cc1)-c1ccccc1
InChI Key InChIKey=QVPWBBCBTGSFHL-UHFFFAOYSA-N
Data  2 IC50  2 EC50
  Tab Delimited (TSV)   2D SDfile   Computed 3D by Vconf -m prep SDfile
Find this compound or compounds like it in BindingDB:
Activity Spreadsheet -- Enzyme Inhibition Constant Data from BindingDB
Found 4 hits for monomerid = 50248343
TargetPeroxisome proliferator-activated receptor alpha(Homo sapiens (Human))
Bristol-Myers Squibb Research And Development
Curated by ChEMBL
LigandPNGBDBM50248343(5-(4-(2-(5-methyl-2-phenyloxazol-4-yl)ethoxy)benzy...)
Affinity DataEC50:  6.15E+3nM. Assay description: Agonist activity at human PPARalpha ligand binding domain expressed in HEK293 cells by Gal4 transactivation assay
In DepthDetails ArticlePubMed
TargetPeroxisome proliferator-activated receptor gamma(Homo sapiens (Human))
Bristol-Myers Squibb Research And Development
Curated by ChEMBL
LigandPNGBDBM50248343(5-(4-(2-(5-methyl-2-phenyloxazol-4-yl)ethoxy)benzy...)
Affinity DataEC50:  9.27E+3nM. Assay description: Agonist activity at human PPARgamma ligand binding domain expressed in HEK293 cells by Gal4 transactivation assay
In DepthDetails ArticlePubMed
TargetPeroxisome proliferator-activated receptor alpha(Homo sapiens (Human))
Bristol-Myers Squibb Research And Development
Curated by ChEMBL
LigandPNGBDBM50248343(5-(4-(2-(5-methyl-2-phenyloxazol-4-yl)ethoxy)benzy...)
Affinity DataIC50:  2.77E+3nM. Assay description: Binding affinity to PPARalpha (unknown origin) by fluorescence polarization assay
In DepthDetails ArticlePubMed
TargetPeroxisome proliferator-activated receptor gamma(Homo sapiens (Human))
Bristol-Myers Squibb Research And Development
Curated by ChEMBL
LigandPNGBDBM50248343(5-(4-(2-(5-methyl-2-phenyloxazol-4-yl)ethoxy)benzy...)
Affinity DataIC50:  712nM. Assay description: Binding affinity to PPARgamma (unknown origin) by fluorescence polarization assay
In DepthDetails ArticlePubMed