BDBM50248879 5,6-Dimethoxy-2-{3-[(piperidin-1-yl)methyl]-benzylidene}-2,3-dihydroinden-1-one::CHEMBL472776
SMILES COc1cc2CC(Cc3cccc(CN4CCCCC4)c3)C(=O)c2cc1OC
InChI Key InChIKey=DDWFGGYILGYLLT-UHFFFAOYSA-N
Data  1 KI  3 IC50
  Tab Delimited (TSV)   2D SDfile   Computed 3D by Vconf -m prep SDfile
Find this compound or compounds like it in BindingDB:
Activity Spreadsheet -- Enzyme Inhibition Constant Data from BindingDB
Found 4 hits for monomerid = 50248879
TargetAcetylcholinesterase(Homo sapiens (Human))TBA
LigandPNGBDBM50248879(5,6-Dimethoxy-2-{3-[(piperidin-1-yl)methyl]-benzyl...)
Affinity DataKi:  59nM. Assay description: Binding affinity to acetylcholinesterase (unknown origin)
In DepthDetails Article
TargetAcetylcholinesterase(Rattus norvegicus (rat))TBA
LigandPNGBDBM50248879(5,6-Dimethoxy-2-{3-[(piperidin-1-yl)methyl]-benzyl...)
Affinity DataIC50:  657nM. Assay description: Inhibition of acetylcholinesterase in Rattus norvegicus (rat) cortex by Ellman method
In DepthDetails Article
TargetCarboxylic ester hydrolase(Rattus norvegicus (rat))
Zhejiang University
Curated by ChEMBL
LigandPNGBDBM50248879(5,6-Dimethoxy-2-{3-[(piperidin-1-yl)methyl]-benzyl...)
Affinity DataIC50:  7.04E+4nM. Assay description: Inhibition of BChE in rat serum after 15 mins by modified Ellman method
In DepthDetails ArticlePubMed
TargetAcetylcholinesterase(Rattus norvegicus (rat))TBA
LigandPNGBDBM50248879(5,6-Dimethoxy-2-{3-[(piperidin-1-yl)methyl]-benzyl...)
Affinity DataIC50:  660nM. Assay description: Inhibition of AChE in rat cortex after 15 mins by modified Ellman method
In DepthDetails ArticlePubMed