BDBM50249194 (15S)-15-methyl-N-(1,3-thiazol-2-yl)tetracyclo[6.6.2.0^{2,7}.0^{9,14}]hexadeca-2,4,6,9(14),10,12-hexaene-15-carboxamide::CHEMBL474576
SMILES C[C@@]1(CC2c3ccccc3C1c1ccccc21)C(=O)Nc1nccs1
InChI Key InChIKey=QYEYUIJWYCBKBG-NGICGMGXSA-N
Data  1 KI  1 EC50
  Tab Delimited (TSV)   2D SDfile   Computed 3D by Vconf -m prep SDfile
Find this compound or compounds like it in BindingDB:
Activity Spreadsheet -- Enzyme Inhibition Constant Data from BindingDB
Found 2 hits for monomerid = 50249194
TargetGlucocorticoid receptor(Homo sapiens (Human))
Bristol-Myers Squibb
Curated by ChEMBL
LigandPNGBDBM50249194((15S)-15-methyl-N-(1,3-thiazol-2-yl)tetracyclo[6.6...)
Affinity DataKi:  26.2nM. Assay description: Displacement of FITC-dexamethasone from human recombinant glucocorticoid receptor alpha by fluorescence polarization assay
In DepthDetails ArticlePubMed
TargetGlucocorticoid receptor(Homo sapiens (Human))
Bristol-Myers Squibb
Curated by ChEMBL
LigandPNGBDBM50249194((15S)-15-methyl-N-(1,3-thiazol-2-yl)tetracyclo[6.6...)
Affinity DataEC50:  544nM. Assay description: Transrepression activity at GR in PMA-stimulated human A549 cells assessed as inhibition of AP1 response element-induced luciferase reporter gene act...
In DepthDetails ArticlePubMed