BDBM50249245 4-(4-(3-(4-chloro-3-(trifluoromethyl)phenyl)ureido)phenoxy)-N-(pyridin-3-yl)picolinamide::CHEMBL514806
SMILES FC(F)(F)c1cc(NC(=O)Nc2ccc(Oc3ccnc(c3)C(=O)Nc3cccnc3)cc2)ccc1Cl
InChI Key InChIKey=RCLIGFJETBEUTM-UHFFFAOYSA-N
Data  1 IC50
  Tab Delimited (TSV)   2D SDfile   Computed 3D by Vconf -m prep SDfile
Find this compound or compounds like it in BindingDB:
Activity Spreadsheet -- Enzyme Inhibition Constant Data from BindingDB
Found 1 hit for monomerid = 50249245
TargetRAF proto-oncogene serine/threonine-protein kinase(Homo sapiens (Human))
China Pharmaceutical University
Curated by ChEMBL
LigandPNGBDBM50249245(4-(4-(3-(4-chloro-3-(trifluoromethyl)phenyl)ureido...)
Affinity DataIC50:  44nM. Assay description: Inhibition of B-Raf1 (unknown origin)
In DepthDetails ArticlePubMed