BDBM50249417 2-(2-aminoethylamino)-4-(3-cyanophenylamino)pyrimidine-5-carboxamide::CHEMBL500086
SMILES NCCNc1ncc(C(N)=O)c(Nc2cccc(c2)C#N)n1
InChI Key InChIKey=BEEQXQHKUJVTQH-UHFFFAOYSA-N
Data  2 IC50
  Tab Delimited (TSV)   2D SDfile   Computed 3D by Vconf -m prep SDfile
Find this compound or compounds like it in BindingDB:
Activity Spreadsheet -- Enzyme Inhibition Constant Data from BindingDB
Found 2 hits for monomerid = 50249417
TargetTyrosine-protein kinase ZAP-70(Homo sapiens (Human))
Gvk Biosciences
Curated by ChEMBL
LigandPNGBDBM50249417(2-(2-aminoethylamino)-4-(3-cyanophenylamino)pyrimi...)
Affinity DataIC50:  8.40E+3nM. Assay description: Inhibition of human GST-fused ZAP-70 expressed in Sf9 cells
In DepthDetails ArticlePubMed
TargetTyrosine-protein kinase SYK(Homo sapiens (Human))
Sichuan University
Curated by ChEMBL
LigandPNGBDBM50249417(2-(2-aminoethylamino)-4-(3-cyanophenylamino)pyrimi...)
Affinity DataIC50:  110nM. Assay description: Inhibition of recombinant Syk (unknown origin)
In DepthDetails ArticlePubMed