BDBM50249466 (R)-2-((3S,4S)-3-((4-(2-benzyloxazol-5-yl)piperidin-1-yl)methyl)-4-phenylpyrrolidin-1-yl)-3-cyclopropylpropanoic acid::CHEMBL480504
SMILES OC(=O)[C@@H](CC1CC1)N1C[C@H](CN2CCC(CC2)c2cnc(Cc3ccccc3)o2)[C@H](C1)c1ccccc1
InChI Key InChIKey=FVHNVQXWBIUQGH-ZGIBFIJWSA-N
Data  2 IC50
  Tab Delimited (TSV)   2D SDfile   Computed 3D by Vconf -m prep SDfile
Find this compound or compounds like it in BindingDB:
Activity Spreadsheet -- Enzyme Inhibition Constant Data from BindingDB
Found 2 hits for monomerid = 50249466
TargetC-C chemokine receptor type 5(Homo sapiens (Human))
Merck Research Laboratories
Curated by ChEMBL
LigandPNGBDBM50249466((R)-2-((3S,4S)-3-((4-(2-benzyloxazol-5-yl)piperidi...)
Affinity DataIC50:  1.60nM. Assay description: Inhibition of human C-C chemokine receptor type 5 assayed using [125I]-MIP-1 alpha as radioligand
In DepthDetails ArticlePubMed
TargetC-C chemokine receptor type 5(Homo sapiens (Human))
Merck Research Laboratories
Curated by ChEMBL
LigandPNGBDBM50249466((R)-2-((3S,4S)-3-((4-(2-benzyloxazol-5-yl)piperidi...)
Affinity DataIC50:  1.60nM. Assay description: Displacement of [125I]MIP1alpha from human CCR5 expressed in CHO cells
In DepthDetails ArticlePubMed