BDBM50249639 4'-(2-{[(2R)-2-(6-Aminopyridin-3-yl)-2-hydroxyethyl]amino}ethyl)-3-ethoxy-N-(methylsulfonyl)biphenyl-4-carboxamide::CHEMBL523149
SMILES CCOc1cc(ccc1C(=O)NS(C)(=O)=O)-c1ccc(CCNC[C@H](O)c2cnccc2N)cc1
InChI Key InChIKey=MNNKHSCZTWBKSS-QHCPKHFHSA-N
Data  2 EC50
  Tab Delimited (TSV)   2D SDfile   Computed 3D by Vconf -m prep SDfile
Find this compound or compounds like it in BindingDB:
Activity Spreadsheet -- Enzyme Inhibition Constant Data from BindingDB
Found 2 hits for monomerid = 50249639
TargetBeta-3 adrenergic receptor(Homo sapiens (Human))
Astellas Pharma
Curated by ChEMBL
LigandPNGBDBM50249639(4'-(2-{[(2R)-2-(6-Aminopyridin-3-yl)-2-hydroxyethy...)
Affinity DataEC50:  0.680nM. Assay description: Agonist activity at human recombinant beta3 adrenergic receptor expressed in CHO cells assessed as cAMP accumulation by enzyme immunoassay
In DepthDetails ArticlePubMed
TargetBeta-1 adrenergic receptor(Homo sapiens (Human))
Astellas Pharma
Curated by ChEMBL
LigandPNGBDBM50249639(4'-(2-{[(2R)-2-(6-Aminopyridin-3-yl)-2-hydroxyethy...)
Affinity DataEC50:  93nM. Assay description: Agonist activity at human recombinant beta-1 adrenergic receptor expressed in CHO cells assessed as cAMP accumulation by enzyme immunoassay
In DepthDetails ArticlePubMed